Stray 302 error in c

stray in \ program diyor derlemiyor hocam okoman December. programı kopyala yapıştır yaparken içinde görünmeyen karakterler olabilir programı önce. porte | = ( 1« 2) ; вместо 2- х знаков lt ( < ) случился какой- то странный знак кавычки. это я написал. paulo1205 ( usa Ubuntu) Enviado em 01/ 09/ : 49h. As mensagens de “ stray ' \ xyz' ” indicam que existem caracteres inesperados no código do programa. · error in bubble sort. cCppLearner i have some error but i can. c: 5: error: stray ‘ \ 302’ in program Sorting. c: 5: error: stray ‘ \ 240’ in program.

  • Error rh 01 2017
  • Error 619 modem entel
  • Toast error code 43
  • Windows activation error 0xc004c020
  • Error code 102 xbox one x


  • Video:Error stray

    Stray error

    linuxのgccで、 ごく簡単な奇数と偶数を判断するC言語のプログラムを書いてみたのですが、 動作しません。 # include < stdio. · Linux下编译C程序出现错误: “ stray ‘ \ 302' in program” 的解决。 阅读量: 22582. SQL Server 的外围应用配置器到哪里去了. · What is a " stray ' \ 302'? Arduino Forum > Using. " C: \ Program Files ( x86. error: stray ' \ 302' in program RF24 radio( CE_ PIN,. При компиляции сыпет вот этим In file included from sketch_ may09a. cpp: 1: C: \ Users\ User\ Documents\ Arduino\ libraries\ MyLib/ MyMenu. For some weird reason, the following code doesn' t compile.

    I get a " stray ' \ 302' in program" error around volatile unsigned int encoderPos = 0;, and I have no idea. · The \ 357 means that the character there is numer 357 in octal ( base 8). On my windows system, all three of your characters look like garbage, so I. · stray ' \ 240' in programstray ' \ 302' in programとはどのような意味でしょうか? ソースとか掲示したり、 エラーメッセージを. I am having problem compiling the followed exploit code: securityfocus. com/ vulnerabilities/ exploits/. c I am using: " gcc file. c" and " gcc - de] > *. c: 3: error: stray ‘ \ 302’ in program > *. c: 3: error: stray ‘ \ 240’ in program > *. c: In function ‘ main’ : > *. c: 5: error: stray ‘ \ 302’ in.

    c: 6: error: stray ' \ 241' in program a. stray ' \ 240' in program stray ' \ 302' in program とはどのような意味でしょうか? A. 以下是对编译错误error: stray ‘ \ 343’ in program的解决方法进行了详细的分析介绍, 如遇此问题的朋友们可以过来参考下. · 【 求教】 error: stray ' \ ' in program. 还有好多错误, 新手编个程序伤不起啊。 果断是c. c: 25: 5: error: stray ‘ \ 302’ in program. c: 25: 5: error: stray ‘ \ 240’ in program. 해결방법은 아래와 같고 이미지와 함께 올려본다. How to fix compilation errors that mention “ stray ‘ \ 342’ ” and “ stray. stray ‘ \ 342’ in program first. c: 4: 1: error: stray ‘ \ 200’ in program. 昨日までコンパイルできていたソースファイルが急にエラー( error: stray) が出てコンパイルできなくなりました。 $ cca. · For those who have already encountered this error " error: stray ‘ \ 302’ in program" or something similar while compiling a program in C.

    · 我在QT代码后加了中文注解, 然后编译后出现这个stray ' \ ' in program . 有没有人懂啊.. error: stray ' \ ' in program sketch_ may19a: 105: error: stray ' \ ' in program sketch_ may19a: 118: error:. Ctrl+ C Ctrl+ V 로 인터넷의 소스를 그대로. Ca sent le fichier encodé en UTF- 8 alors qu' il est supposé être en ISOou inversément. \ 302 c' est pas de l' ISOnormalement, puisque ça s' arrête. · 在vi编辑器中出现如上问题, 你却找不到错在哪。 。 。 当然应该要想到是编辑器的缘故, 所以可以试试以下指令 od - c. Arduino Error Stray ‘ 302' In Program ; Storing passwords in from Chalmers University,. Browse other questions tagged c PC may have, this error can ping with Troubleshoot for Common Arduino Error Stray ‘ 302’ In Program When you use your personal computer and its various functions, it is inevitable to bump. · error: stray ' \ 342' in program. sebgar trying a code for a simple. dll: 1: error: stray ' \ 220' in program In file included from C:. error: stray ‘ \ ’ in. The C programming language allows you to build user. 2 Responses to “ Correcting Arduino Compiler Errors. · Stray Error Arduino - How to fix Stray Error in Arduino?

    arduino error stray ' 302' in program,. " Hangman in C with code". · My Portuguese is too rusty to even try to answer in pt. Hope this helps anyway. I had a similar issue with a code snippet I copied from somewhere. · Здрасти, что это за ошибка такая? error: stray ' \ 235' in program. я их методом Copy/ Paste вставлял. C言語でプログラムしたものをコンパイルしたところ mydispic. c: 151: error: stray ' \ 129' in programmydispic. c: 151: error: stray in program と. You helped me exactly.

    I also copied from pdf and pasted it in. But now there is no problem. 如果你是按照初始路径安装vc6. 0的, 路径应为: executatble files: C: \ Program Files\ Microsoft Visual Studio\ Common\ MSDev98\ Bin. Hi, ich hoffe mir kann jemand helfen. Ich habe ein Problem bei meinem C+ + Programm. Ich bekomme folgende meldungen wenn ich es compilieren möchte:. c: 5: error: stray ‘ \ 302’ in program hello. c: 5: error: stray ‘ \ 250’ in program. 참고로 저는 윈도우 XP에서 vmware를 사용해서 fedora core 6.